{"text_format":"1","workbook":"xlsx","n_sheets":23,"sheets":["HOME","1.0","1.1.a","1.1.b","2.1","2.2","3.1.a","3.1.b","3.1.c","3.2","3.3","3.4","3.5","3.6","RESULTS","Scoring","Hazards-Components","Haz-Comp_User","Property Components","Business Costs","Property Costs","Human Hazards","ResetValues"],"not_rendered":{"charts":1,"images":2,"macros":1,"external_links":0,"defined_names":63,"comments":0,"pivot_tables":0},"unopened":[],"bounds":{"document_bytes":16777216,"sheet_cells":100000,"rows_first":2000,"rows_last":500,"rows_between":2000,"halvings":0,"cell_chars":16384,"cell_head_chars":4096},"cells_cut":0,"cells_raw":0,"read":"whole","date_system":"1900"}

{"sheet":"HOME","index":0,"n_rows":24,"n_cols":9,"rows_kept":24,"cut":false,"hidden":false,"merged":[]}
[]
[]
[]
[]
[]
[]
[null,null,null,null,null,null,null,null,"Healthcare and Public Health Sector"]
[null,null,null,null,null,null,null,null,"Rapid Infrastructure Survey Tool"]
{"$rows_left_out":17}
{"sheet":"1.0","index":1,"n_rows":18,"n_cols":4,"rows_kept":18,"cut":false,"hidden":true,"merged":[[7,3,7,6]]}
[]
[]
[]
[null,"1.0",null,"Subsector Identification"]
[]
[]
[null,"1.0.1    ",{"$f":"D8","v":0},"Which of the following best characterizes the facility’s HPH subsector affiliation?"]
[]
{"$rows_left_out":11}
{"sheet":"1.1.a","index":2,"n_rows":34,"n_cols":6,"rows_kept":34,"cut":false,"hidden":true,"merged":[[10,5,10,9],[16,5,16,9],[29,3,29,14],[19,3,19,14],[23,5,23,9]]}
[]
[1,"Sector Criticality"]
[]
[null,1.1000000000000001,null,"General Criticality Profile (1 of 2)"]
[]
[]
[null,"1.1.1    ",0,"Does the facility use a standardized methodology to determine facility criticality?"]
[]
{"$rows_left_out":27}
{"sheet":"1.1.b","index":3,"n_rows":33,"n_cols":4,"rows_kept":33,"cut":false,"hidden":true,"merged":[[6,3,6,14],[10,3,10,14],[17,3,17,14],[32,3,32,14],[28,3,28,14],[24,3,24,14]]}
[]
[1,"Sector Criticality"]
[]
[null,1.1000000000000001,null,"General Criticality Profile (2 of 2)"]
[]
[]
[null,"1.1.6 ",0,"Can other facilities within the HPH Sector provide similar services or products in the event of a facility or key satellite function disruption without major service impacts or delivery delays?"]
[]
{"$rows_left_out":26}
{"sheet":"2.1","index":4,"n_rows":61,"n_cols":5,"rows_kept":61,"cut":false,"hidden":true,"merged":[[61,3,61,7],[37,3,37,7],[41,3,41,7],[45,3,45,7],[53,4,53,8],[57,4,57,8],[39,3,39,14],[6,3,6,14],[23,3,23,14],[27,3,27,14],[12,3,12,14],[25,3,25,7]]}
[]
[2,"Consequence of Loss or Disruption"]
[]
[null,2.1,null,"General Consequence Profile"]
[]
[]
[null,"2.1.1",{"$f":"COUNTIF(C9:C11,\"TRUE\")","v":0},"Does the facility or any of its satellite operations store or handle the following hazardous materials? "]
[null,null,null,"Check all that apply."]
{"$rows_left_out":54}
{"sheet":"2.2","index":5,"n_rows":17,"n_cols":4,"rows_kept":17,"cut":false,"hidden":true,"merged":[[17,3,17,7],[7,3,7,14],[9,3,9,7],[6,3,6,14],[11,3,11,14],[13,3,13,7]]}
[]
[2,"Consequence of Loss or Disruption"]
[]
[null,2.2000000000000002,null,"Staffing and Critical Supply Disruption Costs"]
[]
[]
[null,"2.2.1",{"$f":"D10","v":0},"What is the additional cost associated with obtaining critical supplies from an alternate vendor/supplier/source should the primary supply chain be disrupted?"]
[null,null,null,"For this value estimate the difference in cost (above normal expenditures) associated with obtaining critical supplies (e.g., pharmaceuticals, medical supplies, manufacturing chemicals, etc.) from an alternate source. Alternate sources of a critical supply can be retail stores, alternate distributors, or manufacturers. "]
{"$rows_left_out":10}
{"sheet":"3.1.a","index":6,"n_rows":58,"n_cols":4,"rows_kept":58,"cut":false,"hidden":true,"merged":[]}
[]
[3,"Subsector-Specific Consequence and Criticality"]
[]
[null,3.1,null,"Direct Patient Care (1 of 3)"]
[]
[]
[null,"3.1.1",0,"Is the facility a Level 1 or Level 2 trauma center?"]
[]
{"$rows_left_out":51}
{"sheet":"3.1.b","index":7,"n_rows":49,"n_cols":12,"rows_kept":49,"cut":false,"hidden":true,"merged":[]}
[]
[3,"Subsector-Specific Consequence and Criticality"]
[]
[null,3.1,null,"Direct Patient Care (2 of 3)"]
[]
[]
[null,"3.1.9",null,"How many patients receive services annually in each of the following units or capability areas within the facility?"]
[]
{"$rows_left_out":42}
{"sheet":"3.1.c","index":8,"n_rows":55,"n_cols":4,"rows_kept":55,"cut":false,"hidden":true,"merged":[[6,3,6,14],[11,3,11,14],[15,3,15,14],[19,3,19,14],[25,3,25,7],[21,3,21,7],[9,3,9,7],[7,3,7,15],[13,3,13,7],[17,3,17,7]]}
[]
[3,"Subsector-Specific Consequence and Criticality"]
[]
[null,3.1,null,"Direct Patient Care (3 of 3)"]
[]
[]
[null,"3.1.10",{"$f":"D10","v":0},"On average, how many patients daily are dependent on electricity for treatment of an acute or chronic life-threatening condition?"]
[null,null,null,"Electricity-dependent patients include those undergoing or utilizing mechanical ventilation, bilevel positive airway pressure, IV infusion pumps, suction pumps, dialysis, oxygen concentrator equipment, etc."]
{"$rows_left_out":48}
{"sheet":"3.2","index":9,"n_rows":19,"n_cols":4,"rows_kept":19,"cut":false,"hidden":true,"merged":[]}
[]
[3,"Subsector-Specific Consequence and Criticality"]
[]
[null,3.2,null,"Healthcare Information Technology (IT)"]
[]
[]
[null,"3.2.1",{"$f":"COUNTIF(C9:C12,\"TRUE\")","v":0},"Do the facility’s networks, systems, or servers manage any of the following?"]
[null,null,null,"Check all that apply."]
{"$rows_left_out":12}
{"sheet":"3.3","index":10,"n_rows":25,"n_cols":5,"rows_kept":25,"cut":false,"hidden":true,"merged":[]}
[]
[3,"Subsector-Specific Consequence and Criticality"]
[]
[null,3.3,null,"Laboratories"]
[]
[]
[null,"3.3.1",0,"Is the facility part of the CDC Response Lab Network (LRN)?"]
[null,null,null,"National lab"]
{"$rows_left_out":18}
{"sheet":"3.4","index":11,"n_rows":21,"n_cols":4,"rows_kept":21,"cut":false,"hidden":true,"merged":[]}
[]
[3,"Subsector-Specific Consequence and Criticality"]
[]
[null,3.4,null,"Blood"]
[]
[]
[null,"3.4.1",0,"How much blood does the facility collect/distribute per year? "]
[null,null,null,"Less than 1,000 units"]
{"$rows_left_out":14}
{"sheet":"3.5","index":12,"n_rows":60,"n_cols":5,"rows_kept":60,"cut":false,"hidden":true,"merged":[[26,3,26,13]]}
[]
[3,"Subsector-Specific Consequence and Criticality"]
[]
[null,3.5,null,"Pharmaceuticals"]
[]
[]
[null,"3.5.1",0,"Does the facility produce, store, or distribute any critical pharmaceuticals? "]
[null,null,null,"Critical pharmaceuticals are those identified in the following references:"]
{"$rows_left_out":53}
{"sheet":"3.6","index":13,"n_rows":30,"n_cols":4,"rows_kept":30,"cut":false,"hidden":true,"merged":[]}
[]
[3,"Subsector-Specific Consequence and Criticality"]
[]
[null,3.6,null,"Medical Materials"]
[]
[]
[null,"3.6.1",0,"Does the facility produce, store, or distribute any critical medical materials? "]
[null,null,null,"Critical pharmaceuticals are those identified in the following references:"]
{"$rows_left_out":23}
{"sheet":"RESULTS","index":14,"n_rows":49,"n_cols":17,"rows_kept":49,"cut":false,"hidden":true,"merged":[[31,3,31,5],[41,3,41,5],[16,6,16,10],[4,1,4,13],[18,3,18,10]]}
[]
[]
[null,"Results"]
[]
[null,"The responses entered into this assessment tool are tabulated into the following Sector Criticality score and three Facility-Specific Consequence Outputs: Human Impact, Property Impact, and Business Impact. \n\nThe Sector Criticality score provides an indication of the level of impact to the Healthcare and Public Health Sector that could be expected due to the loss of function of the facility or asset being assessed. The score ranges from zero to 100, with a score closer to 100 indicating a greater impact to the sector (i.e., high criticality of the asset or facility). \n\nThe Facility-Specific Consequence outputs detail the types and amounts of impacts to the facility and its patients and staff that could be expected to occur given a specific threat or hazard:\n     Human Impact - number of potential injuries or lives lost \n     Property Impact - cost in dollars due to damage or destruction of equipment and property\n     Business Impact - cost in dollars due to loss or disruption and subsequent inability to provide services  \n\nTo return to any specific section of the RIST, click the Show All Sections button to the right, then select the desired section from the tabs at the bottom of the page. To clear all answers and start at the beginning, press the Start Over button at the bottom of the page."]
[]
[]
[]
{"$rows_left_out":42}
{"sheet":"Scoring","index":15,"n_rows":57,"n_cols":64,"rows_kept":57,"cut":false,"hidden":true,"merged":[[56,8,56,11],[42,8,42,11],[33,0,33,5],[33,7,33,12],[42,1,42,4],[46,8,46,11]]}
["Subsector:"]
[{"$f":"SUBSECTOR","v":0}]
[]
[1,"Sector Criticality",null,null,null,null,null,2,"Consequence of Loss or Disruption",null,null,null,null,null,null,null,3.1,"Direct Patient Care",null,null,null,null,null,null,null,3.2,"Health Information Technology (IT)",null,null,null,null,null,null,3.3,"Laboratories",null,null,null,null,null,null,3.4,"Blood",null,null,null,null,null,null,3.5,"Pharmaceuticals",null,null,null,null,null,null,3.6,"Medical Materials"]
["Count",null,null,null,"Max Subtotal","Subtotal",null,"Count",null,null,null,"Max Subtotal","Sector Subtotal","Facility Subtotal",null,null,"Count",null,null,null,null,"Max Subtotal","Sector Subtotal","Facility Subtotal",null,"Count",null,null,null,"Max Subtotal","Sector Subtotal",null,null,"Count",null,null,null,"Max Subtotal","Sector Subtotal",null,null,"Count",null,null,null,"Max Subtotal","Sector Subtotal",null,null,"Count",null,null,null,"Max Subtotal","Sector Subtotal",null,null,"Count",null,null,null,"Max Subtotal","Sector Subtotal"]
[{"$f":"COUNTA(A8:A32)","v":11},null,null,null,{"$f":"SUM(E8:E32)","v":9},{"$f":"SUM(F8:F32)","v":0},null,{"$f":"COUNTA(H8:H32)","v":15},null,null,null,{"$f":"SUM(L8:L32)","v":8},{"$f":"SUM(M8:M32)","v":0},{"$f":"SUM(N8:N32)","v":0},null,null,{"$f":"COUNTA(Q8:Q29)","v":22},null,null,null,null,{"$f":"SUM(V8:V29)","v":16},{"$f":"SUM(W8:W29)","v":0},{"$f":"SUM(X8:X29)","v":0},null,{"$f":"COUNTA(Z8:Z32)","v":2},null,null,null,{"$f":"SUM(AD8:AD32)","v":2},{"$f":"SUM(AE8:AE32)","v":0},null,null,{"$f":"COUNTA(AH8:AH32)","v":4},null,null,null,{"$f":"SUM(AL8:AL32)","v":4},{"$f":"SUM(AM8:AM32)","v":0},null,null,{"$f":"COUNTA(AP8:AP32)","v":3},null,null,null,{"$f":"SUM(AT8:AT32)","v":3},{"$f":"SUM(AU8:AU32)","v":0},null,null,{"$f":"COUNTA(AX8:AX32)","v":9},null,null,null,{"$f":"SUM(BB8:BB32)","v":9},{"$f":"SUM(BC8:BC32)","v":0},null,null,{"$f":"COUNTA(BF8:BF32)","v":5},null,null,null,{"$f":"SUM(BJ8:BJ32)","v":5},{"$f":"SUM(BK8:BK32)","v":0}]
["Question","Response","Type","Max Response","Max Score","Sector Score",null,"Question","Response","Type","Max Response","Max Score","Sector Score","Facility Score","Impact Type",null,"Question","Response","Type","Max Response","N/A","Max Score","Sector Score","Facility Score",null,"Question","Response","Type","Max Response","Max Score","Sector Score","Facility Score",null,"Question","Response","Type","Max Response","Max Score","Sector Score","Facility Score",null,"Question","Response","Type","Max Response","Max Score","Sector Score","Facility Score",null,"Question","Response","Type","Max Response","Max Score","Sector Score","Facility Score",null,"Question","Response","Type","Max Response","Max Score","Sector Score","Facility Score"]
[{"$f":"'1.1.a'!B7","v":"1.1.1    "},{"$f":"'1.1.a'!C7","v":0},"YN",null,null,null,null,{"$f":"'2.1'!B$7","v":"2.1.1"},{"$f":"'2.1'!C$7","v":0},"CB",3,1,{"$f":"I8/K8","v":0},null,null,null,{"$f":"'3.1.a'!B7","v":"3.1.1"},{"$f":"'3.1.a'!C7","v":0},"YN",null,null,1,{"$f":"IF(R8=2,1,0)","v":0},null,null,{"$f":"'3.2'!B7","v":"3.2.1"},{"$f":"'3.2'!C7","v":0},"CB",4,1,{"$f":"AA8/AC8","v":0},null,null,{"$f":"'3.3'!B7","v":"3.3.1"},{"$f":"'3.3'!C7","v":0},"MC",4,1,{"$f":"IF(AI8=0,0,(AI8-1)/(AK8-1))","v":0},null,null,{"$f":"'3.4'!B7","v":"3.4.1"},{"$f":"'3.4'!C7","v":0},"MC",4,1,{"$f":"IF(AQ8=0,0,(AQ8-1)/(AS8-1))","v":0},null,null,{"$f":"'3.5'!B7","v":"3.5.1"},{"$f":"'3.5'!C7","v":0},"YN",null,1,{"$f":"IF(AY8=2,1,0)","v":0},null,null,{"$f":"'3.6'!B7","v":"3.6.1"},{"$f":"'3.6'!C7","v":0},"YN",null,1,{"$f":"IF(BG8=2,1,0)","v":0}]
{"$rows_left_out":50}
{"sheet":"Hazards-Components","index":16,"n_rows":67,"n_cols":14,"rows_kept":67,"cut":false,"hidden":true,"merged":[]}
["Order","Threat/Hazard","Power","Water","Sanitation/waste stream","Heating, ventilation, and air conditioning (HVAC)","Elevators","Communications","Data and information management","Staffing","Steam","Medical gases","Critical Supplies","Regional/Internal"]
[1,"Information Theft",0,0,0,0,0,0,48,0,0,0,0,"Local"]
[2,"Terrorism",48,48,48,48,48,48,48,48,48,48,48,"Regional"]
[3,"Active shooter",0,0,0,0,0,0,0,48,0,0,0,"Local"]
[4,"Cyber",0,0,0,0,0,48,48,0,0,0,0,"Local"]
[5,"Violent Crime",0,0,0,0,0,0,0,48,0,0,0,"Local"]
[6,"Property Crime",0,0,0,0,0,0,0,48,0,0,0,"Local"]
[7,"Earthquake",48,48,48,0,0,0,0,48,48,0,0,"Regional"]
{"$rows_left_out":60}
{"sheet":"Haz-Comp_User","index":17,"n_rows":67,"n_cols":9,"rows_kept":67,"cut":false,"hidden":true,"merged":[]}
["Order","Threat/Hazard","Power","Water","Data and information management","Staffing","Medical gases","Critical Supplies","Regional/ Internal"]
[1,"Information Theft",{"$f":"IF(HAZARD=USER_HAZ_COMP[[#This Row],[Threat/Hazard]], IF(RESULTS!$K$23=\"Yes\", 14, \"0\"), HAZ_COMP[[#This Row],[Power]])","v":0},{"$f":"IF(HAZARD=USER_HAZ_COMP[[#This Row],[Threat/Hazard]], IF(RESULTS!$K$24=\"Yes\", 14, 0),HAZ_COMP[[#This Row],[Water]])","v":0},{"$f":"IF(HAZARD=USER_HAZ_COMP[[#This Row],[Threat/Hazard]], IF(RESULTS!$K$25=\"Yes\", 14, 0),HAZ_COMP[[#This Row],[Data and information management]])","v":48},{"$f":"IF(HAZARD=USER_HAZ_COMP[[#This Row],[Threat/Hazard]], IF(RESULTS!$K$26=\"Yes\", 14, 0),HAZ_COMP[[#This Row],[Staffing]])","v":0},{"$f":"IF(HAZARD=USER_HAZ_COMP[[#This Row],[Threat/Hazard]], IF(RESULTS!$K$27=\"Yes\", 14, \"No\"),HAZ_COMP[[#This Row],[Medical gases]])","v":0},{"$f":"IF(HAZARD=USER_HAZ_COMP[[#This Row],[Threat/Hazard]], IF(RESULTS!$J$43=\"Yes\", 14,0),HAZ_COMP[[#This Row],[Critical Supplies]])","v":0},{"$f":"IF(HAZARD=USER_HAZ_COMP[[#This Row],[Threat/Hazard]], RESULTS!$K$43, HAZ_COMP[[#This Row],[Regional/Internal]])","v":"Local"}]
[2,"Terrorism",{"$f":"IF(HAZARD=USER_HAZ_COMP[[#This Row],[Threat/Hazard]], IF(RESULTS!$K$23=\"Yes\", 14, \"0\"), HAZ_COMP[[#This Row],[Power]])","v":48},{"$f":"IF(HAZARD=USER_HAZ_COMP[[#This Row],[Threat/Hazard]], IF(RESULTS!$K$24=\"Yes\", 14, 0),HAZ_COMP[[#This Row],[Water]])","v":48},{"$f":"IF(HAZARD=USER_HAZ_COMP[[#This Row],[Threat/Hazard]], IF(RESULTS!$K$25=\"Yes\", 14, 0),HAZ_COMP[[#This Row],[Data and information management]])","v":48},{"$f":"IF(HAZARD=USER_HAZ_COMP[[#This Row],[Threat/Hazard]], IF(RESULTS!$K$26=\"Yes\", 14, 0),HAZ_COMP[[#This Row],[Staffing]])","v":48},{"$f":"IF(HAZARD=USER_HAZ_COMP[[#This Row],[Threat/Hazard]], IF(RESULTS!$K$27=\"Yes\", 14, \"No\"),HAZ_COMP[[#This Row],[Medical gases]])","v":48},{"$f":"IF(HAZARD=USER_HAZ_COMP[[#This Row],[Threat/Hazard]], IF(RESULTS!$J$43=\"Yes\", 14,0),HAZ_COMP[[#This Row],[Critical Supplies]])","v":48},{"$f":"IF(HAZARD=USER_HAZ_COMP[[#This Row],[Threat/Hazard]], RESULTS!$K$43, HAZ_COMP[[#This Row],[Regional/Internal]])","v":"Regional"}]
[3,"Active shooter",{"$f":"IF(HAZARD=USER_HAZ_COMP[[#This Row],[Threat/Hazard]], IF(RESULTS!$K$23=\"Yes\", 14, \"0\"), HAZ_COMP[[#This Row],[Power]])","v":0},{"$f":"IF(HAZARD=USER_HAZ_COMP[[#This Row],[Threat/Hazard]], IF(RESULTS!$K$24=\"Yes\", 14, 0),HAZ_COMP[[#This Row],[Water]])","v":0},{"$f":"IF(HAZARD=USER_HAZ_COMP[[#This Row],[Threat/Hazard]], IF(RESULTS!$K$25=\"Yes\", 14, 0),HAZ_COMP[[#This Row],[Data and information management]])","v":0},{"$f":"IF(HAZARD=USER_HAZ_COMP[[#This Row],[Threat/Hazard]], IF(RESULTS!$K$26=\"Yes\", 14, 0),HAZ_COMP[[#This Row],[Staffing]])","v":48},{"$f":"IF(HAZARD=USER_HAZ_COMP[[#This Row],[Threat/Hazard]], IF(RESULTS!$K$27=\"Yes\", 14, \"No\"),HAZ_COMP[[#This Row],[Medical gases]])","v":0},{"$f":"IF(HAZARD=USER_HAZ_COMP[[#This Row],[Threat/Hazard]], IF(RESULTS!$J$43=\"Yes\", 14,0),HAZ_COMP[[#This Row],[Critical Supplies]])","v":0},{"$f":"IF(HAZARD=USER_HAZ_COMP[[#This Row],[Threat/Hazard]], RESULTS!$K$43, HAZ_COMP[[#This Row],[Regional/Internal]])","v":"Local"}]
[4,"Cyber",{"$f":"IF(HAZARD=USER_HAZ_COMP[[#This Row],[Threat/Hazard]], IF(RESULTS!$K$23=\"Yes\", 14, \"0\"), HAZ_COMP[[#This Row],[Power]])","v":0},{"$f":"IF(HAZARD=USER_HAZ_COMP[[#This Row],[Threat/Hazard]], IF(RESULTS!$K$24=\"Yes\", 14, 0),HAZ_COMP[[#This Row],[Water]])","v":0},{"$f":"IF(HAZARD=USER_HAZ_COMP[[#This Row],[Threat/Hazard]], IF(RESULTS!$K$25=\"Yes\", 14, 0),HAZ_COMP[[#This Row],[Data and information management]])","v":48},{"$f":"IF(HAZARD=USER_HAZ_COMP[[#This Row],[Threat/Hazard]], IF(RESULTS!$K$26=\"Yes\", 14, 0),HAZ_COMP[[#This Row],[Staffing]])","v":0},{"$f":"IF(HAZARD=USER_HAZ_COMP[[#This Row],[Threat/Hazard]], IF(RESULTS!$K$27=\"Yes\", 14, \"No\"),HAZ_COMP[[#This Row],[Medical gases]])","v":0},{"$f":"IF(HAZARD=USER_HAZ_COMP[[#This Row],[Threat/Hazard]], IF(RESULTS!$J$43=\"Yes\", 14,0),HAZ_COMP[[#This Row],[Critical Supplies]])","v":0},{"$f":"IF(HAZARD=USER_HAZ_COMP[[#This Row],[Threat/Hazard]], RESULTS!$K$43, HAZ_COMP[[#This Row],[Regional/Internal]])","v":"Local"}]
[5,"Violent Crime",{"$f":"IF(HAZARD=USER_HAZ_COMP[[#This Row],[Threat/Hazard]], IF(RESULTS!$K$23=\"Yes\", 14, \"0\"), HAZ_COMP[[#This Row],[Power]])","v":0},{"$f":"IF(HAZARD=USER_HAZ_COMP[[#This Row],[Threat/Hazard]], IF(RESULTS!$K$24=\"Yes\", 14, 0),HAZ_COMP[[#This Row],[Water]])","v":0},{"$f":"IF(HAZARD=USER_HAZ_COMP[[#This Row],[Threat/Hazard]], IF(RESULTS!$K$25=\"Yes\", 14, 0),HAZ_COMP[[#This Row],[Data and information management]])","v":0},{"$f":"IF(HAZARD=USER_HAZ_COMP[[#This Row],[Threat/Hazard]], IF(RESULTS!$K$26=\"Yes\", 14, 0),HAZ_COMP[[#This Row],[Staffing]])","v":48},{"$f":"IF(HAZARD=USER_HAZ_COMP[[#This Row],[Threat/Hazard]], IF(RESULTS!$K$27=\"Yes\", 14, \"No\"),HAZ_COMP[[#This Row],[Medical gases]])","v":0},{"$f":"IF(HAZARD=USER_HAZ_COMP[[#This Row],[Threat/Hazard]], IF(RESULTS!$J$43=\"Yes\", 14,0),HAZ_COMP[[#This Row],[Critical Supplies]])","v":0},{"$f":"IF(HAZARD=USER_HAZ_COMP[[#This Row],[Threat/Hazard]], RESULTS!$K$43, HAZ_COMP[[#This Row],[Regional/Internal]])","v":"Local"}]
[6,"Property Crime",{"$f":"IF(HAZARD=USER_HAZ_COMP[[#This Row],[Threat/Hazard]], IF(RESULTS!$K$23=\"Yes\", 14, \"0\"), HAZ_COMP[[#This Row],[Power]])","v":0},{"$f":"IF(HAZARD=USER_HAZ_COMP[[#This Row],[Threat/Hazard]], IF(RESULTS!$K$24=\"Yes\", 14, 0),HAZ_COMP[[#This Row],[Water]])","v":0},{"$f":"IF(HAZARD=USER_HAZ_COMP[[#This Row],[Threat/Hazard]], IF(RESULTS!$K$25=\"Yes\", 14, 0),HAZ_COMP[[#This Row],[Data and information management]])","v":0},{"$f":"IF(HAZARD=USER_HAZ_COMP[[#This Row],[Threat/Hazard]], IF(RESULTS!$K$26=\"Yes\", 14, 0),HAZ_COMP[[#This Row],[Staffing]])","v":48},{"$f":"IF(HAZARD=USER_HAZ_COMP[[#This Row],[Threat/Hazard]], IF(RESULTS!$K$27=\"Yes\", 14, \"No\"),HAZ_COMP[[#This Row],[Medical gases]])","v":0},{"$f":"IF(HAZARD=USER_HAZ_COMP[[#This Row],[Threat/Hazard]], IF(RESULTS!$J$43=\"Yes\", 14,0),HAZ_COMP[[#This Row],[Critical Supplies]])","v":0},{"$f":"IF(HAZARD=USER_HAZ_COMP[[#This Row],[Threat/Hazard]], RESULTS!$K$43, HAZ_COMP[[#This Row],[Regional/Internal]])","v":"Local"}]
[7,"Earthquake",{"$f":"IF(HAZARD=USER_HAZ_COMP[[#This Row],[Threat/Hazard]], IF(RESULTS!$K$23=\"Yes\", 14, \"0\"), HAZ_COMP[[#This Row],[Power]])","v":48},{"$f":"IF(HAZARD=USER_HAZ_COMP[[#This Row],[Threat/Hazard]], IF(RESULTS!$K$24=\"Yes\", 14, 0),HAZ_COMP[[#This Row],[Water]])","v":48},{"$f":"IF(HAZARD=USER_HAZ_COMP[[#This Row],[Threat/Hazard]], IF(RESULTS!$K$25=\"Yes\", 14, 0),HAZ_COMP[[#This Row],[Data and information management]])","v":0},{"$f":"IF(HAZARD=USER_HAZ_COMP[[#This Row],[Threat/Hazard]], IF(RESULTS!$K$26=\"Yes\", 14, 0),HAZ_COMP[[#This Row],[Staffing]])","v":48},{"$f":"IF(HAZARD=USER_HAZ_COMP[[#This Row],[Threat/Hazard]], IF(RESULTS!$K$27=\"Yes\", 14, \"No\"),HAZ_COMP[[#This Row],[Medical gases]])","v":0},{"$f":"IF(HAZARD=USER_HAZ_COMP[[#This Row],[Threat/Hazard]], IF(RESULTS!$J$43=\"Yes\", 14,0),HAZ_COMP[[#This Row],[Critical Supplies]])","v":0},{"$f":"IF(HAZARD=USER_HAZ_COMP[[#This Row],[Threat/Hazard]], RESULTS!$K$43, HAZ_COMP[[#This Row],[Regional/Internal]])","v":"Regional"}]
{"$rows_left_out":60}
{"sheet":"Property Components","index":18,"n_rows":68,"n_cols":3,"rows_kept":68,"cut":false,"hidden":true,"merged":[]}
[]
["Threat/Hazard","Cost to Replace Facility","Cost for Temp Facility"]
["Information Theft",0,"No"]
["Terrorism",1,"Yes"]
["Active shooter",0,"No"]
["Cyber",0,"No"]
["Violent Crime",0,"No"]
["Property Crime",0.01,"No"]
{"$rows_left_out":61}
{"sheet":"Business Costs","index":19,"n_rows":14,"n_cols":17,"rows_kept":14,"cut":false,"hidden":true,"merged":[[13,12,13,14],[7,12,7,14],[8,12,8,14],[9,12,9,14],[10,12,10,14],[11,12,11,14]]}
["Threat/Hazard","Regional/Internal"]
[{"$f":"HAZARD","v":0},{"$f":"INDEX(USER_HAZ_COMP[],MATCH(HAZARD,USER_HAZ_COMP[Threat/Hazard],0),9)","v":{"$error":"#N/A"}}]
[]
[null,null,null,{"$f":"#REF!","v":{"$error":"#REF!"}},{"$f":"SUM(#REF!)","v":{"$error":"#REF!"}},null,{"$f":"IF(D4=\"Yes\", MAX(#REF!,$F4), $F4)","v":{"$error":"#REF!"}},{"$f":"#REF!","v":{"$error":"#REF!"}},null,null,null,{"$f":"MIN(SUM($E4,$I4),$G4)","v":{"$error":"#REF!"}},null,null,null,{"$f":"SUM(N4:O4)","v":0}]
[{"$f":"#REF!","v":{"$error":"#REF!"}},{"$f":"#REF!","v":{"$error":"#REF!"}},null,{"$f":"#REF!","v":{"$error":"#REF!"}},{"$f":"SUM(#REF!)","v":{"$error":"#REF!"}},{"$f":"MAX(0,INDEX(HAZ_COMP[],MATCH($A$2,HAZ_COMP[Threat/Hazard],0),MATCH($A5,HAZ_COMP[#Headers],0))-E5)","v":{"$error":"#N/A"}},{"$f":"IF(D5=\"Yes\", MAX(#REF!,$F5), $F5)","v":{"$error":"#REF!"}},{"$f":"#REF!","v":{"$error":"#REF!"}},{"$f":"#REF!","v":{"$error":"#REF!"}},{"$f":"#REF!","v":{"$error":"#REF!"}},{"$f":"#REF!","v":{"$error":"#REF!"}},{"$error":"#REF!"},null,null,null,0,{"$f":"#REF!","v":{"$error":"#REF!"}}]
[]
[]
["Critical System","Affected","Costs",null,null,null,null,null,null,null,null,null,"Hazard Effect Duration",null,null,{"$f":"RESULTS!J40","v":{"$error":"#N/A"}}]
{"$rows_left_out":7}
{"sheet":"Property Costs","index":20,"n_rows":21,"n_cols":3,"rows_kept":21,"cut":false,"hidden":true,"merged":[]}
["Threat/Hazard","Facility Replacement Cost","Temporary Facility Cost"]
[{"$f":"HAZARD","v":0},{"$f":"RESULTS!K32","v":{"$error":"#N/A"}},{"$f":"RESULTS!K35","v":{"$error":"#N/A"}}]
[]
[null,null,"Cost to Restore"]
[{"$f":"#REF!","v":{"$error":"#REF!"}},null,{"$f":"INDEX(PROPERTY[],MATCH($A$2,PROPERTY[Threat/Hazard],0),MATCH($A5,PROPERTY[#Headers],0))","v":{"$error":"#N/A"}}]
[]
[{"$f":"#REF!","v":{"$error":"#REF!"}},null,{"$f":"INDEX(PROPERTY[],MATCH($A$2,PROPERTY[Threat/Hazard],0),MATCH($A7,PROPERTY[#Headers],0))","v":{"$error":"#N/A"}}]
[]
{"$rows_left_out":14}
{"sheet":"Human Hazards","index":21,"n_rows":83,"n_cols":17,"rows_kept":83,"cut":false,"hidden":true,"merged":[]}
["Threat/Hazard","Facility Type"]
[{"$f":"HAZARD","v":0},{"$f":"SUBSECTOR","v":0}]
[]
["Hazard Effect Types:","Description"]
["N/A"]
["Total Destruction","- Total facility population is killed"]
["Direct Lives Lost","- Active shooter only"]
["Staffing Loss"]
{"$rows_left_out":76}
{"sheet":"ResetValues","index":22,"n_rows":32,"n_cols":9,"rows_kept":32,"cut":false,"hidden":true,"merged":[[21,3,21,6],[22,3,22,6],[26,3,26,6],[23,3,23,6],[24,3,24,6],[25,3,25,6]]}
[]
[]
[]
[]
[]
[]
[]
[]
{"$rows_left_out":24}